{"text_format":"1","workbook":"xlsx","n_sheets":3,"sheets":["アスベスト用","保1","依2"],"not_rendered":{"charts":0,"images":0,"macros":1,"external_links":1,"defined_names":3,"comments":0,"pivot_tables":0},"unopened":[],"bounds":{"document_bytes":16777216,"sheet_cells":100000,"rows_first":2000,"rows_last":500,"rows_between":2000,"halvings":0,"cell_chars":16384,"cell_head_chars":4096},"cells_cut":0,"cells_raw":0,"read":"whole","date_system":"1900"}

{"sheet":"アスベスト用","index":0,"n_rows":134,"n_cols":34,"rows_kept":134,"cut":false,"hidden":false,"merged":[[117,23,118,33],[119,23,120,33],[121,23,122,33],[123,23,124,33],[125,23,126,33],[125,8,126,22],[13,21,13,25],[113,8,114,22],[115,8,116,22],[117,8,118,22],[119,8,120,22],[121,8,122,22],[123,8,124,22],[89,8,90,22],[91,8,92,22],[93,8,94,22],[95,8,96,22],[97,8,98,22],[99,8,100,22],[101,8,102,22],[103,8,104,22],[105,8,106,22],[83,8,84,22],[85,8,86,22],[87,8,88,22],[74,23,74,33],[75,23,76,33],[77,23,78,33],[79,23,80,33],[81,23,82,33],[83,23,84,33],[85,23,86,33],[87,23,88,33],[75,8,76,22],[60,5,61,7],[66,5,67,7],[62,5,63,7],[62,8,63,22],[66,8,67,22],[51,2,51,4],[52,2,53,4],[54,2,55,4],[56,2,57,4],[58,2,59,4],[60,2,61,4],[62,2,63,4],[66,2,67,4],[58,5,59,7],[51,5,51,7],[52,5,53,7],[54,5,55,7],[56,5,57,7],[54,8,55,22],[56,8,57,22],[58,8,59,22],[60,8,61,22],[16,26,16,33],[17,26,17,33],[10,2,10,10],[10,27,10,33],[11,2,11,16],[11,19,11,25],[12,2,12,16],[12,19,12,25],[13,2,13,16],[13,27,13,33],[21,2,21,4],[21,5,21,25],[21,27,23,33],[22,2,22,4],[22,5,22,25],[23,2,23,4],[23,5,23,25],[20,2,20,6],[20,7,20,21],[24,2,24,4],[24,5,24,9],[24,10,24,11],[24,12,24,18],[24,19,24,20],[24,21,24,25],[24,27,24,33],[25,2,25,4],[25,5,25,15],[25,16,25,18],[25,27,25,33],[25,19,25,25],[29,2,29,4],[29,5,29,33],[30,2,30,4],[32,2,34,4],[27,2,27,4],[27,5,27,9],[27,10,27,11],[27,12,27,33],[31,2,31,4],[30,5,30,33],[31,5,31,33],[36,30,36,32],[38,2,38,4],[39,2,39,4],[37,30,38,33],[38,5,38,28],[39,5,39,28],[40,5,40,28],[42,5,42,28],[43,5,43,28],[42,2,42,4],[43,2,43,4],[40,2,41,4],[41,5,41,28],[36,10,36,16],[36,18,36,19],[36,20,36,26],[36,28,36,29],[74,2,74,4],[74,5,74,7],[72,2,73,2],[72,3,73,33],[69,24,70,26],[71,3,71,33],[62,23,63,33],[66,23,67,33],[64,23,65,33],[64,8,65,22],[64,5,65,7],[64,2,65,4],[74,8,74,22],[79,2,80,4],[79,5,80,7],[81,2,82,4],[81,5,82,7],[79,8,80,22],[81,8,82,22],[77,2,78,4],[77,5,78,7],[77,8,78,22],[83,2,84,4],[83,5,84,7],[87,2,88,4],[87,5,88,7],[85,2,86,4],[85,5,86,7],[89,2,90,4],[89,5,90,7],[91,2,92,4],[91,5,92,7],[89,23,90,33],[91,23,92,33],[93,2,94,4],[93,5,94,7],[95,2,96,4],[95,5,96,7],[93,23,94,33],[95,23,96,33],[97,2,98,4],[97,5,98,7],[109,23,110,33],[111,23,112,33],[99,2,100,4],[99,5,100,7],[107,8,108,22],[109,8,110,22],[111,8,112,22],[97,23,98,33],[99,23,100,33],[101,2,102,4],[101,5,102,7],[103,2,104,4],[103,5,104,7],[101,23,102,33],[103,23,104,33],[123,2,124,4],[123,5,124,7],[133,23,133,33],[127,2,128,4],[127,5,128,7],[129,2,130,4],[129,5,130,7],[125,2,126,4],[125,5,126,7],[127,8,128,22],[129,8,130,22],[127,23,128,33],[129,23,130,33],[132,23,132,33],[75,2,76,4],[75,5,76,7],[121,2,122,4],[121,5,122,7],[113,2,114,4],[113,5,114,7],[115,2,116,4],[115,5,116,7],[113,23,114,33],[115,23,116,33],[117,2,118,4],[117,5,118,7],[119,2,120,4],[119,5,120,7],[105,2,106,4],[105,5,106,7],[107,2,108,4],[107,5,108,7],[105,23,106,33],[107,23,108,33],[109,2,110,4],[109,5,110,7],[111,2,112,4],[111,5,112,7],[48,9,48,26],[48,29,48,33],[46,2,48,4],[52,23,53,33],[54,23,55,33],[49,2,50,4],[51,8,51,22],[51,23,51,33],[52,8,53,22],[50,24,50,32],[44,5,44,28],[45,2,45,4],[44,2,44,4],[45,5,45,28],[69,27,70,33],[32,5,34,16],[32,17,34,19],[32,20,34,33],[49,5,49,8],[49,27,49,28],[49,29,49,33],[47,9,47,33],[50,5,50,8],[50,9,50,18],[50,19,50,23],[46,5,47,8],[49,9,49,26],[56,23,57,33],[58,23,59,33],[60,23,61,33],[36,2,36,7],[36,8,36,9],[48,27,48,28],[48,5,48,8]]}
[]
[]
[]
[]
[]
[]
[]
[]
[]
[]
[null,null,"検査依頼書"]
[null,null,"一般財団法人　茨城県薬剤師会検査センター",null,null,null,null,null,null,null,null,null,null,null,null,null,null,null,null,"依頼書番号",null,null,null,null,null,null,null,"SN"]
[null,null,"〒310-0852　茨城県水戸市笠原町978-47"]
[null,null,"TEL：029-306-9086　FAX：029-306-9076",null,null,null,null,null,null,null,null,null,null,null,null,null,null,null,null,null,null,"アスベスト用",null,null,null,null,null,"ラベル"]
[]
[null,null,"採取・回収",null,null,"番号記入",null,null,null,"依頼入力",null,null,"成績発送",null,null,null,"請求作成",null,null,"請求発送",null,null,null,"確認"]
[]
[]
[]
[]
{"$rows_left_out":115}
{"sheet":"保1","index":1,"n_rows":36,"n_cols":36,"rows_kept":36,"cut":false,"hidden":true,"merged":[[28,1,28,3],[30,1,30,3],[28,6,31,9],[32,1,32,5],[33,1,33,5],[35,1,35,5],[34,1,34,5],[2,5,2,8],[6,6,6,9],[7,8,7,9],[14,6,15,6],[14,7,15,7],[14,8,14,9],[16,7,17,7],[16,8,16,9],[26,7,27,7],[22,6,23,6],[22,7,23,7],[22,8,22,9],[8,0,9,0],[8,1,9,1],[8,2,9,2],[8,3,9,3],[8,4,9,4],[8,5,9,5],[8,6,9,6],[8,7,9,7],[8,8,8,9],[10,0,11,0],[10,1,11,1],[10,2,11,2],[10,3,11,3],[10,4,11,4],[10,5,11,5],[10,6,11,6],[10,7,11,7],[10,8,10,9],[12,0,13,0],[12,1,13,1],[12,2,13,2],[12,3,13,3],[12,4,13,4],[12,5,13,5],[12,6,13,6],[12,7,13,7],[12,8,12,9],[16,0,17,0],[16,1,17,1],[16,2,17,2],[16,3,17,3],[16,4,17,4],[16,5,17,5],[16,6,17,6],[14,0,15,0],[14,1,15,1],[14,2,15,2],[14,3,15,3],[14,4,15,4],[14,5,15,5],[18,0,19,0],[18,1,19,1],[18,2,19,2],[18,3,19,3],[18,4,19,4],[18,5,19,5],[18,6,19,6],[18,7,19,7],[18,8,18,9],[20,0,21,0],[20,1,21,1],[20,2,21,2],[20,3,21,3],[20,4,21,4],[20,5,21,5],[20,6,21,6],[20,7,21,7],[20,8,20,9],[24,0,25,0],[24,1,25,1],[24,2,25,2],[24,3,25,3],[24,4,25,4],[24,5,25,5],[24,6,25,6],[22,0,23,0],[22,1,23,1],[22,2,23,2],[22,3,23,3],[22,4,23,4],[22,5,23,5],[8,11,9,11],[8,12,9,12],[8,13,9,13],[10,11,11,11],[10,12,11,12],[10,13,11,13],[26,8,26,9],[28,0,35,0],[28,5,29,5],[29,1,29,3],[32,6,32,9],[33,6,35,9],[24,7,25,7],[24,8,24,9],[26,0,27,0],[26,1,27,1],[26,2,27,2],[26,3,27,3],[26,4,27,4],[26,5,27,5],[26,6,27,6],[16,11,17,11],[16,12,17,12],[16,13,17,13],[18,11,19,11],[18,12,19,12],[18,13,19,13],[12,11,13,11],[12,12,13,12],[12,13,13,13],[14,11,15,11],[14,12,15,12],[14,13,15,13],[24,11,25,11],[24,12,25,12],[24,13,25,13],[26,11,27,11],[26,12,27,12],[26,13,27,13],[20,11,21,11],[20,12,21,12],[20,13,21,13],[22,11,23,11],[22,12,23,12],[22,13,23,13]]}
["様式1【S-101検体受付手順書 別紙（10）】",null,null,null,null,null,null,null,null,"2014.12.03改訂",null,"入力",null,null,{"$f":"LEFT(ADDRESS(ROW(),COLUMN(),4,1),LEN(ADDRESS(ROW(),COLUMN(),4,1))-LEN(ROW()))","v":"O"},null,{"$f":"LEFT(ADDRESS(ROW(),COLUMN(),4,1),LEN(ADDRESS(ROW(),COLUMN(),4,1))-LEN(ROW()))","v":"Q"},null,null,null,null,null,null,null,null,null,null,"500　　＋外税　　　　　　　　（保管料込）　　　　　"]
[]
["保存検査　発送・請求記録表",null,null,null,"依頼者",{"$f":"#REF!","v":{"$error":"#REF!"}},null,null,null,"様",null,null,null,null,"←保存開始日",null,null,null,null,null,null,null,null,null,null,null,null,"1000　＋外税　　　　　　　　（保管料込）　　　　　",null,null,null,null,"保",{"$f":"RIGHT(CELL(\"filename\",AA1),LEN(CELL(\"filename\",AA1))-FIND(\"]\",CELL(\"filename\",AA1)))","v":"保1"},{"$f":"VALUE(SUBSTITUTE(AH3,AG3,\"\"))","v":1}]
[]
[null,null,null,"　　　　　　　　　　　都度発送",null,"　要FAX(都度)",null,null,"　　　　都度",null,null,10,null,null,"℃","保存検査マニュアル",null,null,null,null,null,null,null,null,null,null,null,"外税","℃",",保管料","検体名称","検査項目","検査料金","データ集約!","製造","空白"]
[null,null,null,"　　　　　　　　　　　まとめて発送",null,"　要FAX(まとめて)",null,null,"　　　　まとめて",null,null,"製造",null,null,"貼付け　↓",null,null,null,null,null,null,null,null,null,null,null,null,"FO-","保管料"," 保管料",{"$f":"#REF!","v":{"$error":"#REF!"}},{"$f":"#REF!","v":{"$error":"#REF!"}},{"$f":"#REF!","v":{"$error":"#REF!"}},{"$f":"#REF!","v":{"$error":"#REF!"}},"解凍"]
["食品",null,null,null,null,null,"※その都度発送・請求の場合",null,null,null,null,null,null,null,null,"保存検査実施日",null,null,null,null,null,null,null,null,null,null,null,"初発あり","初発","℃保存　　　　","日より　　　　　","日後検査",null,null,"加工"]
["検体名称","受付番号","検査日","検査項目","検査料金","備　考","Ｆ Ａ Ｘ","成績書\n発送　　　　　　　　　　　　　","請求番号\n請求書作成／発送",null,null,"検体名称","受付番号","検査日",null,"経過日","備　考","重複","検索行","総合","料金追加","保管料","初発判断","経過日2"]
[{"$f":"IFERROR(IF(OR(L9=$AJ$5,L9=\"\"),INDIRECT($AH$5&$AE$6&T9),L9),\"\")","v":""},null,{"$f":"IF(INDIRECT(AB9)=\"\",\"\",INDIRECT(AB9))","v":""},{"$f":"IFERROR(SUBSTITUTE(SUBSTITUTE(INDIRECT($AH$5&$AF$6&T9),$AD$5,\"\"),$AD$6,\"\"),\"\")","v":""},{"$f":"IF(T9=\"\",\"\",IF(INDIRECT($AH$5&$AG$6&T9)=\"\",\"\",(INDIRECT($AH$5&$AG$6&T9)&\" + \"&IF(V9=1,$AB$1,IF(V9=100,$AB$3,$AB$5)))))","v":{"$error":"#REF!"}},{"$f":"IF(AND($O$7=$AB$7,W9=1),$AC$7,Q9)","v":"10℃保存　　　　　製造日より　　　　　日後検査"},null,null,"請求№",null,null,null,null,null,null,{"$f":"IF($O$8=\"\",\"\",IF(INDIRECT(AB9)=\"\",\"\",INDIRECT(AB9)-$O$8))","v":""},{"$f":"$L$5&$AD$7&REPT(\"　\",3-LEN($L$5))&$L$6&$AE$7&P9&$AF$7","v":"10℃保存　　　　　製造日より　　　　　日後検査"},{"$f":"IF(L9=\"\",\"\",ASC(L9)&COUNTIF($L$9:L9,L9))","v":""},{"$f":"IFERROR(IF(R9=\"\",\"\",INDEX(#REF!,MATCH(R9,#REF!,0),1)),\"\")","v":""},{"$f":"IF(L9=$AJ$5,\"\",IF(AND(S9=\"\",$AI$3=1),INDIRECT($AH$5&$AH$6&AA9),S9))","v":{"$error":"#REF!"}},{"$f":"IF(A9=\"\",\"\",IF($L$3=\"\",IF(AND(P9>89,P9<>\"\"),100,COUNTIF($A$9:A9,A9)),IF(AND(X9>89,X9<>\"\"),100,COUNTIF($A$9:A9,A9))))","v":""},{"$f":"IF($O$7=$AB$7,IF(U11=100,100,IF(U11=\"\",\"\",1)),IF(U9=100,100,1))","v":1},{"$f":"IF(A9=\"\",\"\",COUNTIF($A$9:A9,A9))","v":""},{"$f":"IF($O$8=\"\",\"\",IF(INDIRECT(AB9)=\"\",\"\",INDIRECT(AB9)-$L$3))","v":""},null,null,11,{"$f":"$O$1&ROW()","v":"O9"}]
[null,null,null,null,null,null,null,null,"(作成)","(発送)"]
[{"$f":"IFERROR(IF(OR(L11=$AJ$5,L11=\"\"),INDIRECT($AH$5&$AE$6&T11),L11),\"\")","v":""},null,{"$f":"IF(INDIRECT(AB11)=\"\",\"\",INDIRECT(AB11))","v":""},{"$f":"IFERROR(SUBSTITUTE(SUBSTITUTE(INDIRECT($AH$5&$AF$6&T11),$AD$5,\"\"),$AD$6,\"\"),\"\")","v":""},{"$f":"IF(T11=\"\",\"\",IF(INDIRECT($AH$5&$AG$6&T11)=\"\",\"\",(INDIRECT($AH$5&$AG$6&T11)&\" + \"&IF(V11=1,$AB$1,IF(V11=100,$AB$3,$AB$5)))))","v":{"$error":"#REF!"}},{"$f":"IF(C11=\"\",\"\",IF(AND($O$7=$AB$7,W11=1),$AC$7,Q11))","v":""},null,null,"請求№",null,null,null,null,null,null,{"$f":"IF($O$8=\"\",\"\",IF(INDIRECT(AB11)=\"\",\"\",INDIRECT(AB11)-$O$8))","v":""},{"$f":"$L$5&$AD$7&REPT(\"　\",3-LEN($L$5))&$L$6&$AE$7&P11&$AF$7","v":"10℃保存　　　　　製造日より　　　　　日後検査"},{"$f":"IF(L11=\"\",\"\",ASC(L11)&COUNTIF($L$9:L11,L11))","v":""},{"$f":"IFERROR(IF(R11=\"\",\"\",INDEX(#REF!,MATCH(R11,#REF!,0),1)),\"\")","v":""},{"$f":"IF(L11=$AJ$5,\"\",IF(AND(S11=\"\",$AI$3=1),INDIRECT($AH$5&$AH$6&AA11),S11))","v":{"$error":"#REF!"}},{"$f":"IF(A11=\"\",\"\",IF($L$3=\"\",IF(AND(P11>89,P11<>\"\"),100,COUNTIF($A$9:A11,A11)),IF(AND(X11>89,X11<>\"\"),100,COUNTIF($A$9:A11,A11))))","v":""},{"$f":"IF($O$7=$AB$7,IF(U13=100,100,IF(U13=\"\",\"\",1)),IF(U11=100,100,1))","v":1},{"$f":"IF(A11=\"\",\"\",COUNTIF($A$9:A11,A11))","v":""},{"$f":"IF($O$8=\"\",\"\",IF(INDIRECT(AB11)=\"\",\"\",INDIRECT(AB11)-$L$3))","v":""},null,null,{"$f":"AA9+1","v":12},{"$f":"$O$1&ROW()","v":"O11"}]
[null,null,null,null,null,null,null,null,"(作成)","(発送)"]
[{"$f":"IFERROR(IF(OR(L13=$AJ$5,L13=\"\"),INDIRECT($AH$5&$AE$6&T13),L13),\"\")","v":""},null,{"$f":"IF(INDIRECT(AB13)=\"\",\"\",INDIRECT(AB13))","v":""},{"$f":"IFERROR(SUBSTITUTE(SUBSTITUTE(INDIRECT($AH$5&$AF$6&T13),$AD$5,\"\"),$AD$6,\"\"),\"\")","v":""},{"$f":"IF(T13=\"\",\"\",IF(INDIRECT($AH$5&$AG$6&T13)=\"\",\"\",(INDIRECT($AH$5&$AG$6&T13)&\" + \"&IF(V13=1,$AB$1,IF(V13=100,$AB$3,$AB$5)))))","v":{"$error":"#REF!"}},{"$f":"IF(C13=\"\",\"\",IF(AND($O$7=$AB$7,W13=1),$AC$7,Q13))","v":""},null,null,"請求№",null,null,null,null,null,null,{"$f":"IF($O$8=\"\",\"\",IF(INDIRECT(AB13)=\"\",\"\",INDIRECT(AB13)-$O$8))","v":""},{"$f":"$L$5&$AD$7&REPT(\"　\",3-LEN($L$5))&$L$6&$AE$7&P13&$AF$7","v":"10℃保存　　　　　製造日より　　　　　日後検査"},{"$f":"IF(L13=\"\",\"\",ASC(L13)&COUNTIF($L$9:L13,L13))","v":""},{"$f":"IFERROR(IF(R13=\"\",\"\",INDEX(#REF!,MATCH(R13,#REF!,0),1)),\"\")","v":""},{"$f":"IF(L13=$AJ$5,\"\",IF(AND(S13=\"\",$AI$3=1),INDIRECT($AH$5&$AH$6&AA13),S13))","v":{"$error":"#REF!"}},{"$f":"IF(A13=\"\",\"\",IF($L$3=\"\",IF(AND(P13>89,P13<>\"\"),100,COUNTIF($A$9:A13,A13)),IF(AND(X13>89,X13<>\"\"),100,COUNTIF($A$9:A13,A13))))","v":""},{"$f":"IF($O$7=$AB$7,IF(U15=100,100,IF(U15=\"\",\"\",1)),IF(U13=100,100,1))","v":1},{"$f":"IF(A13=\"\",\"\",COUNTIF($A$9:A13,A13))","v":""},{"$f":"IF($O$8=\"\",\"\",IF(INDIRECT(AB13)=\"\",\"\",INDIRECT(AB13)-$L$3))","v":""},null,null,{"$f":"AA11+1","v":13},{"$f":"$O$1&ROW()","v":"O13"}]
[null,null,null,null,null,null,null,null,"(作成)","(発送)"]
[{"$f":"IFERROR(IF(OR(L15=$AJ$5,L15=\"\"),INDIRECT($AH$5&$AE$6&T15),L15),\"\")","v":""},null,{"$f":"IF(INDIRECT(AB15)=\"\",\"\",INDIRECT(AB15))","v":""},{"$f":"IFERROR(SUBSTITUTE(SUBSTITUTE(INDIRECT($AH$5&$AF$6&T15),$AD$5,\"\"),$AD$6,\"\"),\"\")","v":""},{"$f":"IF(T15=\"\",\"\",IF(INDIRECT($AH$5&$AG$6&T15)=\"\",\"\",(INDIRECT($AH$5&$AG$6&T15)&\" + \"&IF(V15=1,$AB$1,IF(V15=100,$AB$3,$AB$5)))))","v":{"$error":"#REF!"}},{"$f":"IF(C15=\"\",\"\",IF(AND($O$7=$AB$7,W15=1),$AC$7,Q15))","v":""},null,null,"請求№",null,null,null,null,null,null,{"$f":"IF($O$8=\"\",\"\",IF(INDIRECT(AB15)=\"\",\"\",INDIRECT(AB15)-$O$8))","v":""},{"$f":"$L$5&$AD$7&REPT(\"　\",3-LEN($L$5))&$L$6&$AE$7&P15&$AF$7","v":"10℃保存　　　　　製造日より　　　　　日後検査"},{"$f":"IF(L15=\"\",\"\",ASC(L15)&COUNTIF($L$9:L15,L15))","v":""},{"$f":"IFERROR(IF(R15=\"\",\"\",INDEX(#REF!,MATCH(R15,#REF!,0),1)),\"\")","v":""},{"$f":"IF(L15=$AJ$5,\"\",IF(AND(S15=\"\",$AI$3=1),INDIRECT($AH$5&$AH$6&AA15),S15))","v":{"$error":"#REF!"}},{"$f":"IF(A15=\"\",\"\",IF($L$3=\"\",IF(AND(P15>89,P15<>\"\"),100,COUNTIF($A$9:A15,A15)),IF(AND(X15>89,X15<>\"\"),100,COUNTIF($A$9:A15,A15))))","v":""},{"$f":"IF($O$7=$AB$7,IF(U17=100,100,IF(U17=\"\",\"\",1)),IF(U15=100,100,1))","v":1},{"$f":"IF(A15=\"\",\"\",COUNTIF($A$9:A15,A15))","v":""},{"$f":"IF($O$8=\"\",\"\",IF(INDIRECT(AB15)=\"\",\"\",INDIRECT(AB15)-$L$3))","v":""},null,null,{"$f":"AA13+1","v":14},{"$f":"$O$1&ROW()","v":"O15"}]
[null,null,null,null,null,null,null,null,"(作成)","(発送)"]
[{"$f":"IFERROR(IF(OR(L17=$AJ$5,L17=\"\"),INDIRECT($AH$5&$AE$6&T17),L17),\"\")","v":""},null,{"$f":"IF(INDIRECT(AB17)=\"\",\"\",INDIRECT(AB17))","v":""},{"$f":"IFERROR(SUBSTITUTE(SUBSTITUTE(INDIRECT($AH$5&$AF$6&T17),$AD$5,\"\"),$AD$6,\"\"),\"\")","v":""},{"$f":"IF(T17=\"\",\"\",IF(INDIRECT($AH$5&$AG$6&T17)=\"\",\"\",(INDIRECT($AH$5&$AG$6&T17)&\" + \"&IF(V17=1,$AB$1,IF(V17=100,$AB$3,$AB$5)))))","v":{"$error":"#REF!"}},{"$f":"IF(C17=\"\",\"\",IF(AND($O$7=$AB$7,W17=1),$AC$7,Q17))","v":""},null,null,"請求№",null,null,null,null,null,null,{"$f":"IF($O$8=\"\",\"\",IF(INDIRECT(AB17)=\"\",\"\",INDIRECT(AB17)-$O$8))","v":""},{"$f":"$L$5&$AD$7&REPT(\"　\",3-LEN($L$5))&$L$6&$AE$7&P17&$AF$7","v":"10℃保存　　　　　製造日より　　　　　日後検査"},{"$f":"IF(L17=\"\",\"\",ASC(L17)&COUNTIF($L$9:L17,L17))","v":""},{"$f":"IFERROR(IF(R17=\"\",\"\",INDEX(#REF!,MATCH(R17,#REF!,0),1)),\"\")","v":""},{"$f":"IF(L17=$AJ$5,\"\",IF(AND(S17=\"\",$AI$3=1),INDIRECT($AH$5&$AH$6&AA17),S17))","v":{"$error":"#REF!"}},{"$f":"IF(A17=\"\",\"\",IF($L$3=\"\",IF(AND(P17>89,P17<>\"\"),100,COUNTIF($A$9:A17,A17)),IF(AND(X17>89,X17<>\"\"),100,COUNTIF($A$9:A17,A17))))","v":""},{"$f":"IF($O$7=$AB$7,IF(U19=100,100,IF(U19=\"\",\"\",1)),IF(U17=100,100,1))","v":1},{"$f":"IF(A17=\"\",\"\",COUNTIF($A$9:A17,A17))","v":""},{"$f":"IF($O$8=\"\",\"\",IF(INDIRECT(AB17)=\"\",\"\",INDIRECT(AB17)-$L$3))","v":""},null,null,{"$f":"AA15+1","v":15},{"$f":"$O$1&ROW()","v":"O17"}]
[null,null,null,null,null,null,null,null,"(作成)","(発送)"]
[{"$f":"IFERROR(IF(OR(L19=$AJ$5,L19=\"\"),INDIRECT($AH$5&$AE$6&T19),L19),\"\")","v":""},null,{"$f":"IF(INDIRECT(AB19)=\"\",\"\",INDIRECT(AB19))","v":""},{"$f":"IFERROR(SUBSTITUTE(SUBSTITUTE(INDIRECT($AH$5&$AF$6&T19),$AD$5,\"\"),$AD$6,\"\"),\"\")","v":""},{"$f":"IF(T19=\"\",\"\",IF(INDIRECT($AH$5&$AG$6&T19)=\"\",\"\",(INDIRECT($AH$5&$AG$6&T19)&\" + \"&IF(V19=1,$AB$1,IF(V19=100,$AB$3,$AB$5)))))","v":{"$error":"#REF!"}},{"$f":"IF(C19=\"\",\"\",IF(AND($O$7=$AB$7,W19=1),$AC$7,Q19))","v":""},null,null,"請求№",null,null,null,null,null,null,{"$f":"IF($O$8=\"\",\"\",IF(INDIRECT(AB19)=\"\",\"\",INDIRECT(AB19)-$O$8))","v":""},{"$f":"$L$5&$AD$7&REPT(\"　\",3-LEN($L$5))&$L$6&$AE$7&P19&$AF$7","v":"10℃保存　　　　　製造日より　　　　　日後検査"},{"$f":"IF(L19=\"\",\"\",ASC(L19)&COUNTIF($L$9:L19,L19))","v":""},{"$f":"IFERROR(IF(R19=\"\",\"\",INDEX(#REF!,MATCH(R19,#REF!,0),1)),\"\")","v":""},{"$f":"IF(L19=$AJ$5,\"\",IF(AND(S19=\"\",$AI$3=1),INDIRECT($AH$5&$AH$6&AA19),S19))","v":{"$error":"#REF!"}},{"$f":"IF(A19=\"\",\"\",IF($L$3=\"\",IF(AND(P19>89,P19<>\"\"),100,COUNTIF($A$9:A19,A19)),IF(AND(X19>89,X19<>\"\"),100,COUNTIF($A$9:A19,A19))))","v":""},{"$f":"IF($O$7=$AB$7,IF(U21=100,100,IF(U21=\"\",\"\",1)),IF(U19=100,100,1))","v":1},{"$f":"IF(A19=\"\",\"\",COUNTIF($A$9:A19,A19))","v":""},{"$f":"IF($O$8=\"\",\"\",IF(INDIRECT(AB19)=\"\",\"\",INDIRECT(AB19)-$L$3))","v":""},null,null,{"$f":"AA17+1","v":16},{"$f":"$O$1&ROW()","v":"O19"}]
[null,null,null,null,null,null,null,null,"(作成)","(発送)"]
{"$rows_left_out":17}
{"sheet":"依2","index":2,"n_rows":252,"n_cols":112,"rows_kept":252,"cut":false,"hidden":true,"merged":[[130,9,130,21],[130,22,130,31],[131,9,131,21],[131,22,131,31],[132,9,132,21],[132,22,132,31],[127,9,127,21],[127,22,127,31],[128,9,128,21],[128,22,128,31],[129,9,129,21],[129,22,129,31],[124,9,124,21],[124,22,124,31],[125,9,125,21],[125,22,125,31],[126,9,126,21],[126,22,126,31],[121,9,121,21],[121,22,121,31],[122,9,122,21],[122,22,122,31],[123,9,123,21],[123,22,123,31],[118,9,118,21],[118,22,118,31],[119,9,119,21],[119,22,119,31],[120,9,120,21],[120,22,120,31],[115,9,115,21],[115,22,115,31],[116,9,116,21],[116,22,116,31],[117,9,117,21],[117,22,117,31],[112,9,112,21],[112,22,112,31],[113,9,113,21],[113,22,113,31],[114,9,114,21],[114,22,114,31],[109,9,109,21],[109,22,109,31],[110,9,110,21],[110,22,110,31],[111,9,111,21],[111,22,111,31],[106,9,106,21],[106,22,106,31],[107,9,107,21],[107,22,107,31],[108,9,108,21],[108,22,108,31],[103,9,103,21],[103,22,103,31],[104,9,104,21],[104,22,104,31],[105,9,105,21],[105,22,105,31],[100,9,100,21],[100,22,100,31],[101,9,101,21],[101,22,101,31],[102,9,102,21],[102,22,102,31],[97,9,97,21],[97,22,97,31],[98,9,98,21],[98,22,98,31],[99,9,99,21],[99,22,99,31],[94,9,94,21],[94,22,94,31],[95,9,95,21],[95,22,95,31],[96,9,96,21],[96,22,96,31],[91,9,91,21],[91,22,91,31],[92,9,92,21],[92,22,92,31],[93,9,93,21],[93,22,93,31],[88,9,88,21],[88,22,88,31],[89,9,89,21],[89,22,89,31],[90,9,90,21],[90,22,90,31],[85,9,85,21],[85,22,85,31],[86,9,86,21],[86,22,86,31],[87,9,87,21],[87,22,87,31],[82,9,82,21],[82,22,82,31],[83,9,83,21],[83,22,83,31],[84,9,84,21],[84,22,84,31],[79,9,79,21],[79,22,79,31],[80,9,80,21],[80,22,80,31],[81,9,81,21],[81,22,81,31],[76,9,76,21],[76,22,76,31],[77,9,77,21],[77,22,77,31],[78,9,78,21],[78,22,78,31],[72,9,72,21],[73,9,73,21],[73,22,73,31],[74,9,74,21],[74,22,74,31],[75,9,75,21],[75,22,75,31],[62,11,62,39],[64,30,65,32],[64,33,65,40],[66,9,66,39],[67,8,68,8],[67,9,68,39],[56,11,56,39],[57,11,57,39],[58,11,58,39],[59,11,59,39],[60,11,60,39],[61,11,61,39],[52,11,52,39],[53,11,53,39],[54,8,54,10],[54,11,54,39],[55,8,55,10],[55,11,55,39],[47,8,48,10],[48,11,48,39],[49,11,49,39],[50,8,50,10],[50,11,50,39],[51,11,51,39],[44,8,44,10],[44,11,44,34],[45,8,45,10],[45,11,45,34],[46,8,46,10],[46,11,46,34],[41,8,41,10],[41,11,41,34],[42,8,42,10],[42,11,42,34],[43,8,43,10],[43,11,43,34],[37,36,38,39],[38,8,38,10],[38,11,38,34],[39,8,39,10],[39,11,39,34],[40,8,40,10],[40,11,40,34],[32,8,34,10],[32,11,34,39],[36,8,36,13],[36,14,36,15],[36,16,36,22],[36,24,36,25],[36,26,36,32],[36,34,36,35],[36,36,36,38],[29,8,29,10],[29,11,29,39],[30,8,30,10],[30,11,30,39],[31,8,31,10],[31,11,31,39],[24,33,24,39],[25,8,25,10],[25,11,25,21],[25,22,25,24],[25,33,25,39],[27,8,27,10],[27,11,27,15],[27,16,27,17],[27,18,27,39],[24,8,24,10],[24,11,24,15],[24,16,24,17],[24,18,24,24],[24,25,24,26],[24,27,24,31],[10,8,10,16],[10,33,10,39],[11,8,11,22],[11,25,11,31],[12,8,12,22],[12,25,12,31],[21,8,21,10],[21,11,21,31],[21,33,23,39],[22,8,22,10],[22,11,22,31],[23,8,23,10],[23,11,23,31],[13,8,13,22],[13,29,13,31],[13,33,13,39],[16,32,16,39],[17,32,17,39],[20,8,20,12],[20,13,20,27]]}
[null,null,null,null,null,null,null,null,null,null,null,null,null,null,null,null,null,null,null,null,null,null,null,null,null,null,null,null,null,null,null,null,null,null,null,null,null,null,null,null,null,null,null,null,null,null,{"$f":"LEFT(ADDRESS(ROW(),COLUMN(),4,1),LEN(ADDRESS(ROW(),COLUMN(),4,1))-LEN(ROW()))","v":"AU"},null,null,{"$f":"LEFT(ADDRESS(ROW(),COLUMN(),4,1),LEN(ADDRESS(ROW(),COLUMN(),4,1))-LEN(ROW()))","v":"AX"},null,null,null,null,null,{"$f":"LEFT(ADDRESS(ROW(),COLUMN(),4,1),LEN(ADDRESS(ROW(),COLUMN(),4,1))-LEN(ROW()))","v":"BD"},{"$f":"LEFT(ADDRESS(ROW(),COLUMN(),4,1),LEN(ADDRESS(ROW(),COLUMN(),4,1))-LEN(ROW()))","v":"BE"},{"$f":"LEFT(ADDRESS(ROW(),COLUMN(),4,1),LEN(ADDRESS(ROW(),COLUMN(),4,1))-LEN(ROW()))","v":"BF"},null,null,null,null,null,null,null,{"$f":"LEFT(ADDRESS(ROW(),COLUMN(),4,1),LEN(ADDRESS(ROW(),COLUMN(),4,1))-LEN(ROW()))","v":"BN"}]
[null,null,null,null,null,null,null,null,null,null,null,null,null,null,null,null,null,null,null,null,null,null,null,null,null,null,null,null,null,null,null,null,null,null,null,null,null,null,null,null,null,null,null,null,null,null,"空白"," ",null,null,null,null,null,null,null,null,null,null,null,null,"データ集約!",null,null,null,null,null,null,null,null,null,null,null,null,null,null,null,null,null,null,null,null,null,null,null,null,null,null,"依頼書データ!A:A"]
[null,null,null,null,null,null,null,null,null,null,null,null,null,null,null,null,null,null,null,null,null,null,null,null,null,null,null,null,null,null,null,null,null,null,null,null,null,null,null,null,null,null,null,null,null,null,"依頼書データ!",null,null,null,null,null,null,null,null,null,null,null,null,null,"施設名：同上"]
[]
[null,null,null,null,null,null,null,null,null,null,null,null,null,null,null,null,null,null,null,null,null,null,null,null,null,null,null,null,null,null,null,null,null,null,null,null,null,null,null,null,null,null,null,null,null,null,null,null,"担当者：","TEL:","〒","住所:"]
[]
[]
[]
[null,null,null,null,null,null,null,null,null,null,null,null,null,null,null,null,null,null,null,null,null,null,null,null,null,null,null,null,null,null,null,null,null,null,null,null,null,null,null,null,null,null,null,null,null,null,null,{"$f":"#REF!","v":{"$error":"#REF!"}},{"$f":"#REF!","v":{"$error":"#REF!"}},{"$f":"#REF!","v":{"$error":"#REF!"}},{"$f":"#REF!","v":{"$error":"#REF!"}},{"$f":"#REF!","v":{"$error":"#REF!"}}]
[]
[null,null,null,null,null,null,null,null,"検査依頼書",null,null,null,null,null,null,null,null,null,null,null,null,null,null,null,null,null,null,null,null,null,null,null,null,{"$f":"AV12&AX11&AY12","v":{"$error":"#REF!"}},null,null,null,null,null,null,null,null,null,null,null,null,null,null,null,"-",null,null,null,null,null,null,null,null,null,null,null,null,null,null,null,null,null,null,"P",null,null,null,null,null,null,null,null,null,null,null,null,null,null,null,null,null,"タブ情報"]
[null,null,null,null,null,null,null,null,"一般財団法人　茨城県薬剤師会検査センター",null,null,null,null,null,null,null,null,null,null,null,null,null,null,null,null,"依頼書番号",null,null,null,null,null,null,null,{"$f":"AV50","v":{"$error":"#REF!"}},null,null,null,null,null,null,null,null,null,null,null,null,"A",{"$f":"INDIRECT($AU$3&AU12&($CJ$12+1))","v":{"$error":"#REF!"}},null,"B",{"$f":"INDIRECT($AU$3&AX12&($CJ$14+$CJ$12))","v":{"$error":"#REF!"}},null,null,null,null,null,null,null,null,null,null,null,null,null,null,null,null,null,null,null,null,null,null,null,null,null,null,null,null,null,null,null,null,null,null,null,{"$f":"RIGHT(CELL(\"filename\",AE8),LEN(CELL(\"filename\",AE8))-FIND(\"]\",CELL(\"filename\",AE8)))","v":"依2"},{"$f":"#REF!","v":{"$error":"#REF!"}}]
[null,null,null,null,null,null,null,null,"〒310-0852　茨城県水戸市笠原町978-47",null,null,null,null,null,null,null,null,null,null,null,null,null,null,null,null,{"$f":"AH11","v":{"$error":"#REF!"}}]
[null,null,null,null,null,null,null,null,"TEL：029-306-9086　FAX：029-306-9076",null,null,null,null,null,null,null,null,null,null,null,null,null,null,null,null,null,null,null,null,{"$f":"AH12","v":{"$error":"#REF!"}},null,null,null,"ラベル",null,null,null,null,null,null,null,null,null,null,null,null,null,null,null,null,null,"BP",{"$f":"IFERROR(IF(INDIRECT($AU$3&AZ14&($CJ$14+$CJ$12))=\"\",0,INDIRECT($AU$3&AZ14&($CJ$14+$CJ$12))),0)","v":0},null,null,null,null,null,null,null,null,null,null,null,null,null,null,null,null,null,null,null,null,null,null,null,null,null,null,null,null,null,null,null,null,"行番号","@ORD_SAMPLE",{"$f":"MATCH(CI14,INDIRECT(CJ2),0)","v":{"$error":"#REF!"}}]
[]
[null,null,null,null,null,null,null,null,"採取・回収",null,null,"番号記入",null,null,null,"依頼入力",null,null,"成績発送",null,null,null,"請求作成",null,null,"請求発送",null,null,null,"確認",null,null,null,null,null,null,null,null,null,null,null,null,null,"データ集約",null,null,null,"1=依頼書データ!H10"]
[]
[null,null,null,null,null,null,null,null,null,null,null,null,null,null,null,null,null,null,null,null,null,null,null,null,null,null,null,null,null,null,null,null,null,null,null,null,null,null,null,null,null,null,null,null,null,null,null,null,null,null,null,null,null,null,null,null,null,null,null," 受付日 　　    　　　年　　　月　　　日",null,null,null,null,null,null,"他（合計"]
[null,null,null,null,null,null,null,null,null,null,null,null,null,null,null,null,null,null,null,null,null,null,null,null,null,null,null,null,null,null,null,null,null,null,null,null,null,null,null,null,null,null,null,"ラベル",null,null,null,null,null,null,null,null,null,null,null,null,null,null,null," 受付日　　　",null,null,null,null,null,null,"件）別紙参照"]
[]
{"$rows_left_out":232}